CRAN Package Check Results for Package multimedia

Last updated on 2026-10-27 05:58:20 CET.

Flavor Version Tinstall Tcheck Ttotal Status Flags
r-devel-linux-x86_64-debian-clang 0.2.0 49.52 894.82 944.34 NOTE
r-devel-linux-x86_64-debian-gcc 0.2.0 38.90 678.08 716.98 NOTE
r-devel-linux-x86_64-fedora-clang 0.2.0 48.00 679.59 727.59 NOTE
r-devel-linux-x86_64-fedora-gcc 0.2.0 41.00 648.95 689.95 NOTE
r-devel-windows-x86_64 0.2.0 59.00 798.00 857.00 ERROR
r-patched-linux-x86_64 0.2.0 49.52 907.40 956.92 NOTE
r-release-linux-x86_64 0.2.0 48.36 896.60 944.96 ERROR
r-release-macos-arm64 0.2.0 14.00 210.00 224.00 NOTE
r-release-macos-x86_64 0.2.0 37.00 954.00 991.00 NOTE
r-release-windows-x86_64 0.2.0 54.00 755.00 809.00 ERROR
r-oldrel-macos-arm64 0.2.0 NOTE
r-oldrel-macos-x86_64 0.2.0 33.00 1168.00 1201.00 NOTE
r-oldrel-windows-x86_64 0.2.0 69.00 1126.00 1195.00 ERROR

Check Details

Version: 0.2.0
Check: DESCRIPTION meta-information
Result: NOTE Missing dependency on R >= 4.2.0 because package code uses the pipe placeholder syntax added in R 4.2.0. File(s) using such syntax: ‘predict.R’ ‘sensitivity.R’ ‘treatment_profile.R’ Flavors: r-devel-linux-x86_64-debian-clang, r-devel-linux-x86_64-debian-gcc, r-devel-linux-x86_64-fedora-clang, r-devel-linux-x86_64-fedora-gcc, r-devel-windows-x86_64, r-patched-linux-x86_64, r-release-linux-x86_64, r-release-macos-arm64, r-release-macos-x86_64, r-release-windows-x86_64, r-oldrel-macos-arm64, r-oldrel-macos-x86_64, r-oldrel-windows-x86_64

Version: 0.2.0
Check: tests
Result: ERROR Running 'testthat.R' [100s] Running the tests in 'tests/testthat.R' failed. Complete output: > # This file is part of the standard setup for testthat. > # It is recommended that you do not modify it. > # > # Where should you do additional test configuration? > # Learn more about the roles of various files in: > # * https://r-pkgs.org/testing-design.html#sec-tests-files-overview > # * https://testthat.r-lib.org/articles/special-files.html > > library(testthat) > library(multimedia) Loading required package: brms Loading required package: Rcpp Loading 'brms' package (version 2.23.0). Useful instructions can be found by typing help('brms'). A more detailed introduction to the package is available through vignette('brms_overview'). Attaching package: 'brms' The following object is masked from 'package:stats': ar Loading required package: glmnetUtils Loading required package: ranger Loading required package: tidyselect > > test_check("multimedia") Bootstrapping direct Bootstrapping direct Indirect effects for direct setting 1 Indirect effects for direct setting 2 Compiling Stan program... specified C++17 make cmd is make -f "D:/RCompile/recent/R/etc/x64/Makeconf" -f "D:/RCompile/recent/R/share/make/winshlib.mk" CXX='$(CXX17) $(CXX17STD)' CXXFLAGS='$(CXX17FLAGS)' CXXPICFLAGS='$(CXX17PICFLAGS)' SHLIB_LDFLAGS='$(SHLIB_CXX17LDFLAGS)' SHLIB_LD='$(SHLIB_CXX17LD)' SHLIB="file13804203d7b35.dll" WIN=64 TCLBIN= OBJECTS="file13804203d7b35.o" make would use make[1]: Entering directory '/d/temp/2026_10_25_01_50_00_21025/Rtmp82PuBc' g++ -std=gnu++17 -I"D:/RCompile/recent/R/include" -DNDEBUG -I"D:/RCompile/CRANpkg/lib/4.7/Rcpp/include/" -I"D:/temp/2026_10_25_01_50_00_21025/Rtmp2B1QGK/RLIBS_1b2c441ea6790/RcppEigen/include/" -I"D:/temp/2026_10_25_01_50_00_21025/Rtmp2B1QGK/RLIBS_1b2c441ea6790/RcppEigen/include/unsupported" -I"D:/temp/2026_10_25_01_50_00_21025/Rtmp2B1QGK/RLIBS_1b2c441ea6790/BH/include" -I"D:/RCompile/CRANpkg/lib/4.7/StanHeaders/include/src/" -I"D:/RCompile/CRANpkg/lib/4.7/StanHeaders/include/" -I"D:/RCompile/CRANpkg/lib/4.7/RcppParallel/include/" -DRCPP_PARALLEL_USE_TBB=1 -DTBB_INTERFACE_NEW -ID:/RCompile/CRANpkg/lib/4.7/RcppParallel/include -I"D:/RCompile/CRANpkg/lib/4.7/rstan/include" -DEIGEN_NO_DEBUG -DBOOST_DISABLE_ASSERTS -DBOOST_PENDING_INTEGER_LOG2_HPP -DSTAN_THREADS -DUSE_STANC3 -DSTRICT_R_HEADERS -DBOOST_PHOENIX_NO_VARIADIC_EXPRESSION -D_HAS_AUTO_PTR_ETC=0 -include "D:/RCompile/CRANpkg/lib/4.7/StanHeaders/include/stan/math/prim/fun/Eigen.hpp" -std=c++1y -I"d:/rtools45/x86_64-w64-mingw32.static.posix/include" -O2 -Wall -mfpmath=sse -msse2 -mstackrealign -c file13804203d7b35.cpp -o file13804203d7b35.o if test "zfile13804203d7b35.o" != "z"; then \ if test -e "file13804203d7b35-win.def"; then \ echo g++ -shared -s -static-libgcc -o file13804203d7b35.dll file13804203d7b35-win.def file13804203d7b35.o "D:/RCompile/CRANpkg/lib/4.7/rstan/lib/x64/libStanServices.a" -L"D:/RCompile/CRANpkg/lib/4.7/StanHeaders/libs/x64" -lStanHeaders -L"D:/RCompile/CRANpkg/lib/4.7/RcppParallel/lib/x64" -ltbb -LD:/RCompile/CRANpkg/lib/4.7/RcppParallel/libs/x64 -lRcppParallel -LD:/RCompile/CRANpkg/lib/4.7/RcppParallel/lib/x64 -ltbb -ltbbmalloc -L"d:/rtools45/x86_64-w64-mingw32.static.posix/lib/x64" -L"d:/rtools45/x86_64-w64-mingw32.static.posix/lib" -L"D:/RCompile/recent/R/bin/x64" -lR ; \ g++ -shared -s -static-libgcc -o file13804203d7b35.dll file13804203d7b35-win.def file13804203d7b35.o "D:/RCompile/CRANpkg/lib/4.7/rstan/lib/x64/libStanServices.a" -L"D:/RCompile/CRANpkg/lib/4.7/StanHeaders/libs/x64" -lStanHeaders -L"D:/RCompile/CRANpkg/lib/4.7/RcppParallel/lib/x64" -ltbb -LD:/RCompile/CRANpkg/lib/4.7/RcppParallel/libs/x64 -lRcppParallel -LD:/RCompile/CRANpkg/lib/4.7/RcppParallel/lib/x64 -ltbb -ltbbmalloc -L"d:/rtools45/x86_64-w64-mingw32.static.posix/lib/x64" -L"d:/rtools45/x86_64-w64-mingw32.static.posix/lib" -L"D:/RCompile/recent/R/bin/x64" -lR ; \ else \ echo EXPORTS > tmp.def; \ nm file13804203d7b35.o | sed -n 's/^.* [BCDRT] / /p' | sed -e '/[.]refptr[.]/d' -e '/[.]weak[.]/d' | sed 's/[^ ][^ ]*/"&"/g' >> tmp.def; \ echo g++ -shared -s -static-libgcc -o file13804203d7b35.dll tmp.def file13804203d7b35.o "D:/RCompile/CRANpkg/lib/4.7/rstan/lib/x64/libStanServices.a" -L"D:/RCompile/CRANpkg/lib/4.7/StanHeaders/libs/x64" -lStanHeaders -L"D:/RCompile/CRANpkg/lib/4.7/RcppParallel/lib/x64" -ltbb -LD:/RCompile/CRANpkg/lib/4.7/RcppParallel/libs/x64 -lRcppParallel -LD:/RCompile/CRANpkg/lib/4.7/RcppParallel/lib/x64 -ltbb -ltbbmalloc -L"d:/rtools45/x86_64-w64-mingw32.static.posix/lib/x64" -L"d:/rtools45/x86_64-w64-mingw32.static.posix/lib" -L"D:/RCompile/recent/R/bin/x64" -lR ; \ g++ -shared -s -static-libgcc -o file13804203d7b35.dll tmp.def file13804203d7b35.o "D:/RCompile/CRANpkg/lib/4.7/rstan/lib/x64/libStanServices.a" -L"D:/RCompile/CRANpkg/lib/4.7/StanHeaders/libs/x64" -lStanHeaders -L"D:/RCompile/CRANpkg/lib/4.7/RcppParallel/lib/x64" -ltbb -LD:/RCompile/CRANpkg/lib/4.7/RcppParallel/libs/x64 -lRcppParallel -LD:/RCompile/CRANpkg/lib/4.7/RcppParallel/lib/x64 -ltbb -ltbbmalloc -L"d:/rtools45/x86_64-w64-mingw32.static.posix/lib/x64" -L"d:/rtools45/x86_64-w64-mingw32.static.posix/lib" -L"D:/RCompile/recent/R/bin/x64" -lR ; \ rm -f tmp.def; \ fi \ fi make[1]: Leaving directory '/d/temp/2026_10_25_01_50_00_21025/Rtmp82PuBc' Saving _problems/test-estimators-29.R Fitting the nullified model... Generating synthetic data... Fitting the full model on synthetic data... Estimating effects on real and synthetic data... Fitting the nullified model... Generating synthetic data... Fitting the full model on synthetic data... Estimating effects on real and synthetic data... Fitting the nullified model... Generating synthetic data... Fitting the full model on synthetic data... Estimating effects on real and synthetic data... Fitting the nullified model... Generating synthetic data... Fitting the full model on synthetic data... Estimating effects on real and synthetic data... Indirect effects for direct setting 1 Indirect effects for direct setting 2 Indirect effects for direct setting 1 Indirect effects for direct setting 2 Indirect effects for direct setting 1 Indirect effects for direct setting 2 Indirect effects for direct setting 1 Indirect effects for direct setting 2 Indirect effects for direct setting 1 Indirect effects for direct setting 2 Indirect effects for direct setting 1 Indirect effects for direct setting 2 Indirect effects for direct setting 1 Indirect effects for direct setting 2 Indirect effects for direct setting 1 Indirect effects for direct setting 2 Indirect effects for direct setting 1 Indirect effects for direct setting 2 [ FAIL 2 | WARN 11 | SKIP 0 | PASS 86 ] ══ Failed tests ════════════════════════════════════════════════════════════════ ── Error ('test-estimators.R:29:5'): Can compile and estimate a BRMS model. ──── Error in `compileCode(f, code, language = language, verbose = verbose)`: l = model1380424a24903__namespace::model1380424a24903_; BaseRNG = boost::random::additive_combine_engine<boost::random::linear_congruential_engine<unsigned int, 40014, 0, 2147483563>, boost::random::linear_congruential_engine<unsigned int, 40692, 0, 2147483399> >]' 22 | return 0.5 * z.p.transpose() * z.inv_e_metric_ * z.p; D:/RCompile/CRANpkg/lib/4.7/StanHeaders/include/src/stan/mcmc/hmc/hamiltonians/dense_e_metric.hpp:21:0: required from here 21 | double T(dense_e_point& z) { D:/RCompile/CRANpkg/lib/4.7/RcppEigen/include/Eigen/src/Core/DenseCoeffsBase.h:654:74: warning: ignoring attributes on template argument 'Eigen::internal::packet_traits<double>::type' {aka '__m128d'} [-Wignored-attributes] 654 | return internal::first_aligned<int(unpacket_traits<DefaultPacketType>::alignment),Derived>(m); | ^~~~~~~~~ make[1]: *** [D:/RCompile/recent/R/etc/x64/Makeconf:304: file13804203d7b35.o] Error 1 Backtrace: ▆ 1. └─multimedia::estimate(model, exper) at test-estimators.R:29:5 2. └─multimedia (local) outcome_est(f, data) 3. ├─rlang::inject(brm_cache(fmla, data, !!!params)) 4. └─multimedia:::brm_cache(fmla, data, chains = 1, refresh = 0, silent = 0) 5. └─brms::brm(sub_formula(formula, ys[1]), data, ...) 6. └─brms::do_call(compile_model, compile_args) 7. └─brms:::eval2(call, envir = args, enclos = envir) 8. └─base::eval(expr, envir, ...) 9. └─base::eval(expr, envir, ...) 10. └─brms (local) .fun(...) 11. └─brms (local) .compile_model(model, ...) 12. ├─brms:::eval_silent(...) 13. │ └─base::eval(expr, envir) 14. │ └─base::eval(expr, envir) 15. └─brms::do_call(rstan::stan_model, args) 16. └─brms:::eval2(call, envir = args, enclos = envir) 17. └─base::eval(expr, envir, ...) 18. └─base::eval(expr, envir, ...) 19. └─rstan (local) .fun(model_code = .x1) 20. └─rstan:::cxxfunctionplus(...) 21. ├─pkgbuild::with_build_tools(...) 22. │ └─pkgbuild:::withr_with_path(rtools_path(), code) 23. │ └─base::force(code) 24. └─inline::cxxfunction(...) 25. └─inline:::compileCode(f, code, language = language, verbose = verbose) ── Error ('test-estimators.R:29:5'): Can compile and estimate a BRMS model. ──── Error in `sink(type = "output")`: invalid connection Backtrace: ▆ 1. └─multimedia::estimate(model, exper) at test-estimators.R:29:5 2. └─multimedia (local) outcome_est(f, data) 3. ├─rlang::inject(brm_cache(fmla, data, !!!params)) 4. └─multimedia:::brm_cache(fmla, data, chains = 1, refresh = 0, silent = 0) 5. └─brms::brm(sub_formula(formula, ys[1]), data, ...) 6. └─brms::do_call(compile_model, compile_args) 7. └─brms:::eval2(call, envir = args, enclos = envir) 8. └─base::eval(expr, envir, ...) 9. └─base::eval(expr, envir, ...) 10. └─brms (local) .fun(...) 11. └─brms (local) .compile_model(model, ...) 12. ├─brms:::eval_silent(...) 13. │ └─base::eval(expr, envir) 14. │ └─base::eval(expr, envir) 15. └─brms::do_call(rstan::stan_model, args) 16. └─brms:::eval2(call, envir = args, enclos = envir) 17. └─base::eval(expr, envir, ...) 18. └─base::eval(expr, envir, ...) 19. └─rstan (local) .fun(model_code = .x1) 20. └─rstan:::cxxfunctionplus(...) 21. └─base::sink(type = "output") [ FAIL 2 | WARN 11 | SKIP 0 | PASS 86 ] Error: ! Test failures. Execution halted Flavor: r-devel-windows-x86_64

Version: 0.2.0
Check: re-building of vignette outputs
Result: ERROR Error(s) in re-building vignettes: ... --- re-building ‘illustration.Rmd’ using rmarkdown Quitting from illustration.Rmd:133-138 [sensitivity_analysis] ~~~~~~~~~~~~~~~~~~~~~~~~~~~~~~~~~~~~~~~~~~~~~~~~~~~~~~~~~~~~~~~~~~~~~~~~~~~~~~~~ <1b>[1m<1b>[34m<error/rlang_error><1b>[39m<1b>[22m <1b>[1m<1b>[33mError<1b>[39m:<1b>[22m <1b>[33m!<1b>[39m cannot open the connection --- <1b>[1mBacktrace:<1b>[22m <1b>[90m <1b>[39m▆ <1b>[90m 1. <1b>[39m├─<1b>[1mreadr<1b>[22m::read_csv("https://go.wisc.edu/0xcyr1") <1b>[90m 2. <1b>[39m│ <1b>[90m└─<1b>[1mvroom<1b>[22m::vroom(...)<1b>[39m <1b>[90m 3. <1b>[39m│ <1b>[90m└─vroom:::vroom_(...)<1b>[39m <1b>[90m 4. <1b>[39m└─vroom (local) `<fn>`(`<curl>`, "rb") <1b>[90m 5. <1b>[39m └─<1b>[1mbase<1b>[22m::tryCatch(...) <1b>[90m 6. <1b>[39m └─base (local) tryCatchList(expr, classes, parentenv, handlers) <1b>[90m 7. <1b>[39m └─base (local) tryCatchOne(expr, names, parentenv, handlers[[1L]]) <1b>[90m 8. <1b>[39m └─value[[3L]](cond) ~~~~~~~~~~~~~~~~~~~~~~~~~~~~~~~~~~~~~~~~~~~~~~~~~~~~~~~~~~~~~~~~~~~~~~~~~~~~~~~~ Error: processing vignette 'illustration.Rmd' failed with diagnostics: cannot open the connection --- failed re-building ‘illustration.Rmd’ --- re-building ‘random.Rmd’ using rmarkdown [WARNING] Deprecated: --mathjax. Use --math-method=mathjax[:URL] instead. --- finished re-building ‘random.Rmd’ SUMMARY: processing the following file failed: ‘illustration.Rmd’ Error: Vignette re-building failed. Execution halted Flavor: r-release-linux-x86_64

Version: 0.2.0
Check: tests
Result: ERROR Running 'testthat.R' [93s] Running the tests in 'tests/testthat.R' failed. Complete output: > # This file is part of the standard setup for testthat. > # It is recommended that you do not modify it. > # > # Where should you do additional test configuration? > # Learn more about the roles of various files in: > # * https://r-pkgs.org/testing-design.html#sec-tests-files-overview > # * https://testthat.r-lib.org/articles/special-files.html > > library(testthat) > library(multimedia) Loading required package: brms Loading required package: Rcpp Loading 'brms' package (version 2.23.0). Useful instructions can be found by typing help('brms'). A more detailed introduction to the package is available through vignette('brms_overview'). Attaching package: 'brms' The following object is masked from 'package:stats': ar Loading required package: glmnetUtils Loading required package: ranger Loading required package: tidyselect > > test_check("multimedia") Bootstrapping direct Bootstrapping direct Indirect effects for direct setting 1 Indirect effects for direct setting 2 Compiling Stan program... specified C++17 make cmd is make -f "D:/RCompile/recent/R-4.6.1/etc/x64/Makeconf" -f "D:/RCompile/recent/R-4.6.1/share/make/winshlib.mk" CXX='$(CXX17) $(CXX17STD)' CXXFLAGS='$(CXX17FLAGS)' CXXPICFLAGS='$(CXX17PICFLAGS)' SHLIB_LDFLAGS='$(SHLIB_CXX17LDFLAGS)' SHLIB_LD='$(SHLIB_CXX17LD)' SHLIB="file69e2079347880.dll" WIN=64 TCLBIN= OBJECTS="file69e2079347880.o" make would use make[1]: Entering directory '/d/temp/2026_10_21_01_50_00_6553/RtmpWYNlTk' g++ -std=gnu++17 -I"D:/RCompile/recent/R-4.6.1/include" -DNDEBUG -I"D:/RCompile/CRANpkg/lib/4.6/Rcpp/include/" -I"D:/temp/2026_10_21_01_50_00_6553/RtmpEpOBDz/RLIBS_23e7843b13ab9/RcppEigen/include/" -I"D:/temp/2026_10_21_01_50_00_6553/RtmpEpOBDz/RLIBS_23e7843b13ab9/RcppEigen/include/unsupported" -I"D:/temp/2026_10_21_01_50_00_6553/RtmpEpOBDz/RLIBS_23e7843b13ab9/BH/include" -I"D:/RCompile/CRANpkg/lib/4.6/StanHeaders/include/src/" -I"D:/RCompile/CRANpkg/lib/4.6/StanHeaders/include/" -I"D:/RCompile/CRANpkg/lib/4.6/RcppParallel/include/" -DRCPP_PARALLEL_USE_TBB=1 -DTBB_INTERFACE_NEW -ID:/RCompile/CRANpkg/lib/4.6/RcppParallel/include -I"D:/RCompile/CRANpkg/lib/4.6/rstan/include" -DEIGEN_NO_DEBUG -DBOOST_DISABLE_ASSERTS -DBOOST_PENDING_INTEGER_LOG2_HPP -DSTAN_THREADS -DUSE_STANC3 -DSTRICT_R_HEADERS -DBOOST_PHOENIX_NO_VARIADIC_EXPRESSION -D_HAS_AUTO_PTR_ETC=0 -include "D:/RCompile/CRANpkg/lib/4.6/StanHeaders/include/stan/math/prim/fun/Eigen.hpp" -std=c++1y -I"d:/rtools45/x86_64-w64-mingw32.static.posix/include" -O2 -Wall -mfpmath=sse -msse2 -mstackrealign -c file69e2079347880.cpp -o file69e2079347880.o if test "zfile69e2079347880.o" != "z"; then \ if test -e "file69e2079347880-win.def"; then \ echo g++ -shared -s -static-libgcc -o file69e2079347880.dll file69e2079347880-win.def file69e2079347880.o "D:/RCompile/CRANpkg/lib/4.6/rstan/lib/x64/libStanServices.a" -L"D:/RCompile/CRANpkg/lib/4.6/StanHeaders/libs/x64" -lStanHeaders -L"D:/RCompile/CRANpkg/lib/4.6/RcppParallel/lib/x64" -ltbb -LD:/RCompile/CRANpkg/lib/4.6/RcppParallel/libs/x64 -lRcppParallel -LD:/RCompile/CRANpkg/lib/4.6/RcppParallel/lib/x64 -ltbb -ltbbmalloc -L"d:/rtools45/x86_64-w64-mingw32.static.posix/lib/x64" -L"d:/rtools45/x86_64-w64-mingw32.static.posix/lib" -L"D:/RCompile/recent/R-4.6.1/bin/x64" -lR ; \ g++ -shared -s -static-libgcc -o file69e2079347880.dll file69e2079347880-win.def file69e2079347880.o "D:/RCompile/CRANpkg/lib/4.6/rstan/lib/x64/libStanServices.a" -L"D:/RCompile/CRANpkg/lib/4.6/StanHeaders/libs/x64" -lStanHeaders -L"D:/RCompile/CRANpkg/lib/4.6/RcppParallel/lib/x64" -ltbb -LD:/RCompile/CRANpkg/lib/4.6/RcppParallel/libs/x64 -lRcppParallel -LD:/RCompile/CRANpkg/lib/4.6/RcppParallel/lib/x64 -ltbb -ltbbmalloc -L"d:/rtools45/x86_64-w64-mingw32.static.posix/lib/x64" -L"d:/rtools45/x86_64-w64-mingw32.static.posix/lib" -L"D:/RCompile/recent/R-4.6.1/bin/x64" -lR ; \ else \ echo EXPORTS > tmp.def; \ nm file69e2079347880.o | sed -n 's/^.* [BCDRT] / /p' | sed -e '/[.]refptr[.]/d' -e '/[.]weak[.]/d' | sed 's/[^ ][^ ]*/"&"/g' >> tmp.def; \ echo g++ -shared -s -static-libgcc -o file69e2079347880.dll tmp.def file69e2079347880.o "D:/RCompile/CRANpkg/lib/4.6/rstan/lib/x64/libStanServices.a" -L"D:/RCompile/CRANpkg/lib/4.6/StanHeaders/libs/x64" -lStanHeaders -L"D:/RCompile/CRANpkg/lib/4.6/RcppParallel/lib/x64" -ltbb -LD:/RCompile/CRANpkg/lib/4.6/RcppParallel/libs/x64 -lRcppParallel -LD:/RCompile/CRANpkg/lib/4.6/RcppParallel/lib/x64 -ltbb -ltbbmalloc -L"d:/rtools45/x86_64-w64-mingw32.static.posix/lib/x64" -L"d:/rtools45/x86_64-w64-mingw32.static.posix/lib" -L"D:/RCompile/recent/R-4.6.1/bin/x64" -lR ; \ g++ -shared -s -static-libgcc -o file69e2079347880.dll tmp.def file69e2079347880.o "D:/RCompile/CRANpkg/lib/4.6/rstan/lib/x64/libStanServices.a" -L"D:/RCompile/CRANpkg/lib/4.6/StanHeaders/libs/x64" -lStanHeaders -L"D:/RCompile/CRANpkg/lib/4.6/RcppParallel/lib/x64" -ltbb -LD:/RCompile/CRANpkg/lib/4.6/RcppParallel/libs/x64 -lRcppParallel -LD:/RCompile/CRANpkg/lib/4.6/RcppParallel/lib/x64 -ltbb -ltbbmalloc -L"d:/rtools45/x86_64-w64-mingw32.static.posix/lib/x64" -L"d:/rtools45/x86_64-w64-mingw32.static.posix/lib" -L"D:/RCompile/recent/R-4.6.1/bin/x64" -lR ; \ rm -f tmp.def; \ fi \ fi make[1]: Leaving directory '/d/temp/2026_10_21_01_50_00_6553/RtmpWYNlTk' Saving _problems/test-estimators-29.R Fitting the nullified model... Generating synthetic data... Fitting the full model on synthetic data... Estimating effects on real and synthetic data... Fitting the nullified model... Generating synthetic data... Fitting the full model on synthetic data... Estimating effects on real and synthetic data... Fitting the nullified model... Generating synthetic data... Fitting the full model on synthetic data... Estimating effects on real and synthetic data... Fitting the nullified model... Generating synthetic data... Fitting the full model on synthetic data... Estimating effects on real and synthetic data... Indirect effects for direct setting 1 Indirect effects for direct setting 2 Indirect effects for direct setting 1 Indirect effects for direct setting 2 Indirect effects for direct setting 1 Indirect effects for direct setting 2 Indirect effects for direct setting 1 Indirect effects for direct setting 2 Indirect effects for direct setting 1 Indirect effects for direct setting 2 Indirect effects for direct setting 1 Indirect effects for direct setting 2 Indirect effects for direct setting 1 Indirect effects for direct setting 2 Indirect effects for direct setting 1 Indirect effects for direct setting 2 Indirect effects for direct setting 1 Indirect effects for direct setting 2 [ FAIL 2 | WARN 1 | SKIP 0 | PASS 86 ] ══ Failed tests ════════════════════════════════════════════════════════════════ ── Error ('test-estimators.R:29:5'): Can compile and estimate a BRMS model. ──── Error in `compileCode(f, code, language = language, verbose = verbose)`: del69e20685910cc__namespace::model69e20685910cc_; BaseRNG = boost::random::additive_combine_engine<boost::random::linear_congruential_engine<unsigned int, 40014, 0, 2147483563>, boost::random::linear_congruential_engine<unsigned int, 40692, 0, 2147483399> >]' 22 | return 0.5 * z.p.transpose() * z.inv_e_metric_ * z.p; D:/RCompile/CRANpkg/lib/4.6/StanHeaders/include/src/stan/mcmc/hmc/hamiltonians/dense_e_metric.hpp:21:0: required from here 21 | double T(dense_e_point& z) { D:/RCompile/CRANpkg/lib/4.6/RcppEigen/include/Eigen/src/Core/DenseCoeffsBase.h:654:74: warning: ignoring attributes on template argument 'Eigen::internal::packet_traits<double>::type' {aka '__m128d'} [-Wignored-attributes] 654 | return internal::first_aligned<int(unpacket_traits<DefaultPacketType>::alignment),Derived>(m); | ^~~~~~~~~ make[1]: *** [D:/RCompile/recent/R-4.6.1/etc/x64/Makeconf:304: file69e2079347880.o] Error 1 Backtrace: ▆ 1. └─multimedia::estimate(model, exper) at test-estimators.R:29:5 2. └─multimedia (local) outcome_est(f, data) 3. ├─rlang::inject(brm_cache(fmla, data, !!!params)) 4. └─multimedia:::brm_cache(fmla, data, chains = 1, refresh = 0, silent = 0) 5. └─brms::brm(sub_formula(formula, ys[1]), data, ...) 6. └─brms::do_call(compile_model, compile_args) 7. └─brms:::eval2(call, envir = args, enclos = envir) 8. └─base::eval(expr, envir, ...) 9. └─base::eval(expr, envir, ...) 10. └─brms (local) .fun(...) 11. └─brms (local) .compile_model(model, ...) 12. ├─brms:::eval_silent(...) 13. │ └─base::eval(expr, envir) 14. │ └─base::eval(expr, envir) 15. └─brms::do_call(rstan::stan_model, args) 16. └─brms:::eval2(call, envir = args, enclos = envir) 17. └─base::eval(expr, envir, ...) 18. └─base::eval(expr, envir, ...) 19. └─rstan (local) .fun(model_code = .x1) 20. └─rstan:::cxxfunctionplus(...) 21. ├─pkgbuild::with_build_tools(...) 22. │ └─pkgbuild:::withr_with_path(rtools_path(), code) 23. │ └─base::force(code) 24. └─inline::cxxfunction(...) 25. └─inline:::compileCode(f, code, language = language, verbose = verbose) ── Error ('test-estimators.R:29:5'): Can compile and estimate a BRMS model. ──── Error in `sink(type = "output")`: invalid connection Backtrace: ▆ 1. └─multimedia::estimate(model, exper) at test-estimators.R:29:5 2. └─multimedia (local) outcome_est(f, data) 3. ├─rlang::inject(brm_cache(fmla, data, !!!params)) 4. └─multimedia:::brm_cache(fmla, data, chains = 1, refresh = 0, silent = 0) 5. └─brms::brm(sub_formula(formula, ys[1]), data, ...) 6. └─brms::do_call(compile_model, compile_args) 7. └─brms:::eval2(call, envir = args, enclos = envir) 8. └─base::eval(expr, envir, ...) 9. └─base::eval(expr, envir, ...) 10. └─brms (local) .fun(...) 11. └─brms (local) .compile_model(model, ...) 12. ├─brms:::eval_silent(...) 13. │ └─base::eval(expr, envir) 14. │ └─base::eval(expr, envir) 15. └─brms::do_call(rstan::stan_model, args) 16. └─brms:::eval2(call, envir = args, enclos = envir) 17. └─base::eval(expr, envir, ...) 18. └─base::eval(expr, envir, ...) 19. └─rstan (local) .fun(model_code = .x1) 20. └─rstan:::cxxfunctionplus(...) 21. └─base::sink(type = "output") [ FAIL 2 | WARN 1 | SKIP 0 | PASS 86 ] Error: ! Test failures. Execution halted Flavor: r-release-windows-x86_64

Version: 0.2.0
Check: tests
Result: ERROR Running 'testthat.R' [129s] Running the tests in 'tests/testthat.R' failed. Complete output: > # This file is part of the standard setup for testthat. > # It is recommended that you do not modify it. > # > # Where should you do additional test configuration? > # Learn more about the roles of various files in: > # * https://r-pkgs.org/testing-design.html#sec-tests-files-overview > # * https://testthat.r-lib.org/articles/special-files.html > > library(testthat) > library(multimedia) Loading required package: brms Loading required package: Rcpp Loading 'brms' package (version 2.23.0). Useful instructions can be found by typing help('brms'). A more detailed introduction to the package is available through vignette('brms_overview'). Attaching package: 'brms' The following object is masked from 'package:stats': ar Loading required package: glmnetUtils Loading required package: ranger Loading required package: tidyselect > > test_check("multimedia") Bootstrapping direct Bootstrapping direct Indirect effects for direct setting 1 Indirect effects for direct setting 2 Compiling Stan program... make cmd is make -f "D:/RCompile/recent/R-4.5.3/etc/x64/Makeconf" -f "D:/RCompile/recent/R-4.5.3/share/make/winshlib.mk" CXX='$(CXX17) $(CXX17STD)' CXXFLAGS='$(CXX17FLAGS)' CXXPICFLAGS='$(CXX17PICFLAGS)' SHLIB_LDFLAGS='$(SHLIB_CXX17LDFLAGS)' SHLIB_LD='$(SHLIB_CXX17LD)' SHLIB="file6631823b7f10.dll" WIN=64 TCLBIN= OBJECTS="file6631823b7f10.o" make would use make[1]: Entering directory '/d/temp/2026_10_23_16_39_25_24216/RtmpkfYqRR' g++ -std=gnu++17 -I"D:/RCompile/recent/R-4.5.3/include" -DNDEBUG -I"D:/RCompile/CRANpkg/lib/4.5/Rcpp/include/" -I"D:/temp/2026_10_23_16_39_25_24216/RtmpqsgOpP/RLIBS_6894f515c35/RcppEigen/include/" -I"D:/temp/2026_10_23_16_39_25_24216/RtmpqsgOpP/RLIBS_6894f515c35/RcppEigen/include/unsupported" -I"D:/temp/2026_10_23_16_39_25_24216/RtmpqsgOpP/RLIBS_6894f515c35/BH/include" -I"D:/RCompile/CRANpkg/lib/4.5/StanHeaders/include/src/" -I"D:/RCompile/CRANpkg/lib/4.5/StanHeaders/include/" -I"D:/RCompile/CRANpkg/lib/4.5/RcppParallel/include/" -DRCPP_PARALLEL_USE_TBB=1 -DTBB_INTERFACE_NEW -ID:/RCompile/CRANpkg/lib/4.5/RcppParallel/include -I"D:/RCompile/CRANpkg/lib/4.5/rstan/include" -DEIGEN_NO_DEBUG -DBOOST_DISABLE_ASSERTS -DBOOST_PENDING_INTEGER_LOG2_HPP -DSTAN_THREADS -DUSE_STANC3 -DSTRICT_R_HEADERS -DBOOST_PHOENIX_NO_VARIADIC_EXPRESSION -D_HAS_AUTO_PTR_ETC=0 -include "D:/RCompile/CRANpkg/lib/4.5/StanHeaders/include/stan/math/prim/fun/Eigen.hpp" -std=c++1y -I"d:/rtools45/x86_64-w64-mingw32.static.posix/include" -O2 -Wall -mfpmath=sse -msse2 -mstackrealign -c file6631823b7f10.cpp -o file6631823b7f10.o if test "zfile6631823b7f10.o" != "z"; then \ if test -e "file6631823b7f10-win.def"; then \ echo g++ -shared -s -static-libgcc -o file6631823b7f10.dll file6631823b7f10-win.def file6631823b7f10.o "D:/RCompile/CRANpkg/lib/4.5/rstan/lib/x64/libStanServices.a" -L"D:/RCompile/CRANpkg/lib/4.5/StanHeaders/libs/x64" -lStanHeaders -L"D:/RCompile/CRANpkg/lib/4.5/RcppParallel/lib/x64" -ltbb -LD:/RCompile/CRANpkg/lib/4.5/RcppParallel/libs/x64 -lRcppParallel -LD:/RCompile/CRANpkg/lib/4.5/RcppParallel/lib/x64 -ltbb -ltbbmalloc -L"d:/rtools45/x86_64-w64-mingw32.static.posix/lib/x64" -L"d:/rtools45/x86_64-w64-mingw32.static.posix/lib" -L"D:/RCompile/recent/R-4.5.3/bin/x64" -lR ; \ g++ -shared -s -static-libgcc -o file6631823b7f10.dll file6631823b7f10-win.def file6631823b7f10.o "D:/RCompile/CRANpkg/lib/4.5/rstan/lib/x64/libStanServices.a" -L"D:/RCompile/CRANpkg/lib/4.5/StanHeaders/libs/x64" -lStanHeaders -L"D:/RCompile/CRANpkg/lib/4.5/RcppParallel/lib/x64" -ltbb -LD:/RCompile/CRANpkg/lib/4.5/RcppParallel/libs/x64 -lRcppParallel -LD:/RCompile/CRANpkg/lib/4.5/RcppParallel/lib/x64 -ltbb -ltbbmalloc -L"d:/rtools45/x86_64-w64-mingw32.static.posix/lib/x64" -L"d:/rtools45/x86_64-w64-mingw32.static.posix/lib" -L"D:/RCompile/recent/R-4.5.3/bin/x64" -lR ; \ else \ echo EXPORTS > tmp.def; \ nm file6631823b7f10.o | sed -n 's/^.* [BCDRT] / /p' | sed -e '/[.]refptr[.]/d' -e '/[.]weak[.]/d' | sed 's/[^ ][^ ]*/"&"/g' >> tmp.def; \ echo g++ -shared -s -static-libgcc -o file6631823b7f10.dll tmp.def file6631823b7f10.o "D:/RCompile/CRANpkg/lib/4.5/rstan/lib/x64/libStanServices.a" -L"D:/RCompile/CRANpkg/lib/4.5/StanHeaders/libs/x64" -lStanHeaders -L"D:/RCompile/CRANpkg/lib/4.5/RcppParallel/lib/x64" -ltbb -LD:/RCompile/CRANpkg/lib/4.5/RcppParallel/libs/x64 -lRcppParallel -LD:/RCompile/CRANpkg/lib/4.5/RcppParallel/lib/x64 -ltbb -ltbbmalloc -L"d:/rtools45/x86_64-w64-mingw32.static.posix/lib/x64" -L"d:/rtools45/x86_64-w64-mingw32.static.posix/lib" -L"D:/RCompile/recent/R-4.5.3/bin/x64" -lR ; \ g++ -shared -s -static-libgcc -o file6631823b7f10.dll tmp.def file6631823b7f10.o "D:/RCompile/CRANpkg/lib/4.5/rstan/lib/x64/libStanServices.a" -L"D:/RCompile/CRANpkg/lib/4.5/StanHeaders/libs/x64" -lStanHeaders -L"D:/RCompile/CRANpkg/lib/4.5/RcppParallel/lib/x64" -ltbb -LD:/RCompile/CRANpkg/lib/4.5/RcppParallel/libs/x64 -lRcppParallel -LD:/RCompile/CRANpkg/lib/4.5/RcppParallel/lib/x64 -ltbb -ltbbmalloc -L"d:/rtools45/x86_64-w64-mingw32.static.posix/lib/x64" -L"d:/rtools45/x86_64-w64-mingw32.static.posix/lib" -L"D:/RCompile/recent/R-4.5.3/bin/x64" -lR ; \ rm -f tmp.def; \ fi \ fi make[1]: Leaving directory '/d/temp/2026_10_23_16_39_25_24216/RtmpkfYqRR' Saving _problems/test-estimators-29.R Fitting the nullified model... Generating synthetic data... Fitting the full model on synthetic data... Estimating effects on real and synthetic data... Fitting the nullified model... Generating synthetic data... Fitting the full model on synthetic data... Estimating effects on real and synthetic data... Fitting the nullified model... Generating synthetic data... Fitting the full model on synthetic data... Estimating effects on real and synthetic data... Fitting the nullified model... Generating synthetic data... Fitting the full model on synthetic data... Estimating effects on real and synthetic data... Indirect effects for direct setting 1 Indirect effects for direct setting 2 Indirect effects for direct setting 1 Indirect effects for direct setting 2 Indirect effects for direct setting 1 Indirect effects for direct setting 2 Indirect effects for direct setting 1 Indirect effects for direct setting 2 Indirect effects for direct setting 1 Indirect effects for direct setting 2 Indirect effects for direct setting 1 Indirect effects for direct setting 2 Indirect effects for direct setting 1 Indirect effects for direct setting 2 Indirect effects for direct setting 1 Indirect effects for direct setting 2 Indirect effects for direct setting 1 Indirect effects for direct setting 2 [ FAIL 2 | WARN 1 | SKIP 0 | PASS 86 ] ══ Failed tests ════════════════════════════════════════════════════════════════ ── Error ('test-estimators.R:29:5'): Can compile and estimate a BRMS model. ──── Error in `compileCode(f, code, language = language, verbose = verbose)`: odel66318541b669c__namespace::model66318541b669c_; BaseRNG = boost::random::additive_combine_engine<boost::random::linear_congruential_engine<unsigned int, 40014, 0, 2147483563>, boost::random::linear_congruential_engine<unsigned int, 40692, 0, 2147483399> >]' 22 | return 0.5 * z.p.transpose() * z.inv_e_metric_ * z.p; D:/RCompile/CRANpkg/lib/4.5/StanHeaders/include/src/stan/mcmc/hmc/hamiltonians/dense_e_metric.hpp:21:0: required from here 21 | double T(dense_e_point& z) { D:/RCompile/CRANpkg/lib/4.5/RcppEigen/include/Eigen/src/Core/DenseCoeffsBase.h:654:74: warning: ignoring attributes on template argument 'Eigen::internal::packet_traits<double>::type' {aka '__m128d'} [-Wignored-attributes] 654 | return internal::first_aligned<int(unpacket_traits<DefaultPacketType>::alignment),Derived>(m); | ^~~~~~~~~ make[1]: *** [D:/RCompile/recent/R-4.5.3/etc/x64/Makeconf:302: file6631823b7f10.o] Error 1 Backtrace: ▆ 1. └─multimedia::estimate(model, exper) at test-estimators.R:29:5 2. └─multimedia (local) outcome_est(f, data) 3. ├─rlang::inject(brm_cache(fmla, data, !!!params)) 4. └─multimedia:::brm_cache(fmla, data, chains = 1, refresh = 0, silent = 0) 5. └─brms::brm(sub_formula(formula, ys[1]), data, ...) 6. └─brms::do_call(compile_model, compile_args) 7. └─brms:::eval2(call, envir = args, enclos = envir) 8. └─base::eval(expr, envir, ...) 9. └─base::eval(expr, envir, ...) 10. └─brms (local) .fun(...) 11. └─brms (local) .compile_model(model, ...) 12. ├─brms:::eval_silent(...) 13. │ └─base::eval(expr, envir) 14. │ └─base::eval(expr, envir) 15. └─brms::do_call(rstan::stan_model, args) 16. └─brms:::eval2(call, envir = args, enclos = envir) 17. └─base::eval(expr, envir, ...) 18. └─base::eval(expr, envir, ...) 19. └─rstan (local) .fun(model_code = .x1) 20. └─rstan:::cxxfunctionplus(...) 21. ├─pkgbuild::with_build_tools(...) 22. │ └─pkgbuild:::withr_with_path(rtools_path(), code) 23. │ └─base::force(code) 24. └─inline::cxxfunction(...) 25. └─inline:::compileCode(f, code, language = language, verbose = verbose) ── Error ('test-estimators.R:29:5'): Can compile and estimate a BRMS model. ──── Error in `sink(type = "output")`: invalid connection Backtrace: ▆ 1. └─multimedia::estimate(model, exper) at test-estimators.R:29:5 2. └─multimedia (local) outcome_est(f, data) 3. ├─rlang::inject(brm_cache(fmla, data, !!!params)) 4. └─multimedia:::brm_cache(fmla, data, chains = 1, refresh = 0, silent = 0) 5. └─brms::brm(sub_formula(formula, ys[1]), data, ...) 6. └─brms::do_call(compile_model, compile_args) 7. └─brms:::eval2(call, envir = args, enclos = envir) 8. └─base::eval(expr, envir, ...) 9. └─base::eval(expr, envir, ...) 10. └─brms (local) .fun(...) 11. └─brms (local) .compile_model(model, ...) 12. ├─brms:::eval_silent(...) 13. │ └─base::eval(expr, envir) 14. │ └─base::eval(expr, envir) 15. └─brms::do_call(rstan::stan_model, args) 16. └─brms:::eval2(call, envir = args, enclos = envir) 17. └─base::eval(expr, envir, ...) 18. └─base::eval(expr, envir, ...) 19. └─rstan (local) .fun(model_code = .x1) 20. └─rstan:::cxxfunctionplus(...) 21. └─base::sink(type = "output") [ FAIL 2 | WARN 1 | SKIP 0 | PASS 86 ] Error: ! Test failures. Execution halted Flavor: r-oldrel-windows-x86_64